# Build from source - "no, program does not run"

**URL:** <https://forum.zcashcommunity.com/t/build-from-source-no-program-does-not-run/18476>\
**Category:** Technical Support\
**Created:** [July 2, 2017, 4:00pm UTC](https://forum.zcashcommunity.com/t/build-from-source-no-program-does-not-run/18476 "2017-07-02T16:00:19Z")\
**Posts on this page:** 2\
**Page:** 1

<div class="post-metadata">

**Author:** ![4c6565](https://avatars.discourse-cdn.com/v4/letter/4/cab0a1/32.png) [@4c6565](https://forum.zcashcommunity.com/u/4c6565)\
**Post date:** [July 2, 2017, 4:00pm UTC](https://forum.zcashcommunity.com/t/build-from-source-no-program-does-not-run/18476/1 "2017-07-02T16:00:19Z")

</div>

After running

```
./zcutil/build.sh --disable-rust

```

I get the following

```
checking whether to enable maintainer-specific portions of Makefiles... no
checking ABI=64
checking compiler gcc -m64 -pipe -O1 -I/zcash/depends/x86_64-unknown-linux-gnu/include ... no, program does not run
checking ABI=x32
checking compiler gcc -m64 -pipe -O1 -I/zcash/depends/x86_64-unknown-linux-gnu/include ... no, program does not run
checking ABI=32
checking compiler gcc -m64 -pipe -O1 -I/zcash/depends/x86_64-unknown-linux-gnu/include ... no, program does not run
configure: error: could not find a working compiler, see config.log for details
funcs.mk:242: recipe for target '/zcash/depends/work/build/x86_64-unknown-linux-gnu/libgmp/6.1.1-500d6b79756/./.stamp_configured' failed
make: *** [/zcash/depends/work/build/x86_64-unknown-linux-gnu/libgmp/6.1.1-500d6b79756/./.stamp_configured] Error 1
make: Leaving directory '/zcash/depends'

```

Everything prior seems to run.

checking gcc version gives:

```
checking whether to enable maintainer-specific portions of Makefiles... no
checking ABI=64
checking compiler gcc -m64 -pipe -O1 -I/zcash/depends/x86_64-unknown-linux-gnu/include ... no, program does not run
checking ABI=x32
checking compiler gcc -m64 -pipe -O1 -I/zcash/depends/x86_64-unknown-linux-gnu/include ... no, program does not run
checking ABI=32
checking compiler gcc -m64 -pipe -O1 -I/zcash/depends/x86_64-unknown-linux-gnu/include ... no, program does not run
configure: error: could not find a working compiler, see config.log for details
funcs.mk:242: recipe for target '/zcash/depends/work/build/x86_64-unknown-linux-gnu/libgmp/6.1.1-500d6b79756/./.stamp_configured' failed
make: *** [/zcash/depends/work/build/x86_64-unknown-linux-gnu/libgmp/6.1.1-500d6b79756/./.stamp_configured] Error 1
make: Leaving directory '/zcash/depends'

```

Any advice much appreciated.

Thanks 🙂

---

<div class="post-metadata">

**Author:** ![daira](https://sea2.discourse-cdn.com/zcash/user_avatar/forum.zcashcommunity.com/daira/32/43253_2.png) [@daira](https://forum.zcashcommunity.com/u/daira)\
**Post date:** [July 10, 2017, 5:25pm UTC](https://forum.zcashcommunity.com/t/build-from-source-no-program-does-not-run/18476/2 "2017-07-10T17:25:38Z")

</div>

Can you post the contents of `config.log`, please? (It’s sufficient to post the part that has the gcc error message.)
