# Zcash alpha on lubunto doesn't work

**URL:** <https://forum.zcashcommunity.com/t/zcash-alpha-on-lubunto-doesnt-work/912>\
**Category:** zcashd client\
**Created:** [June 28, 2016, 4:27pm UTC](https://forum.zcashcommunity.com/t/zcash-alpha-on-lubunto-doesnt-work/912 "2016-06-28T16:27:56Z")\
**Posts on this page:** 16\
**Page:** 1

<div class="post-metadata">

**Author:** ![gianluca](https://avatars.discourse-cdn.com/v4/letter/g/82dd89/32.png) [@gianluca](https://forum.zcashcommunity.com/u/gianluca)\
**Post date:** [June 28, 2016, 4:27pm UTC](https://forum.zcashcommunity.com/t/zcash-alpha-on-lubunto-doesnt-work/912/1 "2016-06-28T16:27:57Z")

</div>

where i fail to test theb pubblic aplha on lubunto 16.04?  
It stil not work, it seem that can’t fetch

here a list of my terminal

overe e 134 non aggiornati.  
jeanluc@cucc:~ sudo apt-get install libgtest-dev Lettura elenco dei pacchetti... Fatto Generazione albero delle dipendenze..Generazione albero delle dipendenze..Generazione albero delle dipendenze..Generazione albero delle dipendenze..Generazione albero delle dipendenze Lettura informazioni sullo stato... 0Lettura informazioni sullo stato... 0Lettura informazioni sullo stato... Fatto libgtest-dev is already the newest version (1.7.0-4ubuntu1). 0 aggiornati, 0 installati, 0 da rimuovere e 134 non aggiornati. jeanluc@cucc:~ sudo apt-get install libc6-dev  
Lettura elenco dei pacchetti… Fatto  
Generazione albero delle dipendenze…Generazione albero delle dipendenze…Generazione albero delle dipendenze…Generazione albero delle dipendenze…Generazione albero delle dipendenze  
Lettura informazioni sullo stato… 0Lettura informazioni sullo stato… 0Lettura informazioni sullo stato… Fatto  
libc6-dev is already the newest version (2.23-0ubuntu3).  
0 aggiornati, 0 installati, 0 da rimuovere e 134 non aggiornati.  
jeanluc@cucc:~ sudo apt-get install m4 Lettura elenco dei pacchetti... Fatto Generazione albero delle dipendenze..Generazione albero delle dipendenze..Generazione albero delle dipendenze..Generazione albero delle dipendenze..Generazione albero delle dipendenze Lettura informazioni sullo stato... 0Lettura informazioni sullo stato... 0Lettura informazioni sullo stato... Fatto m4 is already the newest version (1.4.17-5). 0 aggiornati, 0 installati, 0 da rimuovere e 134 non aggiornati. jeanluc@cucc:~ sudo apt-get install g+±multilib  
Lettura elenco dei pacchetti… Fatto  
Generazione albero delle dipendenze…Generazione albero delle dipendenze…Generazione albero delle dipendenze…Generazione albero delle dipendenze…Generazione albero delle dipendenze  
Lettura informazioni sullo stato… 0Lettura informazioni sullo stato… 0Lettura informazioni sullo stato… Fatto  
g+±multilib is already the newest version (4:5.3.1-1ubuntu1).  
0 aggiornati, 0 installati, 0 da rimuovere e 134 non aggiornati.  
jeanluc@cucc:~ sudo apt-get install autoconf Lettura elenco dei pacchetti... Fatto Generazione albero delle dipendenze..Generazione albero delle dipendenze..Generazione albero delle dipendenze..Generazione albero delle dipendenze..Generazione albero delle dipendenze Lettura informazioni sullo stato... 0Lettura informazioni sullo stato... 0Lettura informazioni sullo stato... Fatto autoconf is already the newest version (2.69-9). 0 aggiornati, 0 installati, 0 da rimuovere e 134 non aggiornati. jeanluc@cucc:~ sudo apt-get install libtool  
Lettura elenco dei pacchetti… Fatto  
Generazione albero delle dipendenze…Generazione albero delle dipendenze…Generazione albero delle dipendenze…Generazione albero delle dipendenze…Generazione albero delle dipendenze  
Lettura informazioni sullo stato… 0Lettura informazioni sullo stato… 0Lettura informazioni sullo stato… Fatto  
libtool is already the newest version (2.4.6-0.1).  
0 aggiornati, 0 installati, 0 da rimuovere e 134 non aggiornati.  
jeanluc@cucc:~ sudo apt-get install ncurses-dev Lettura elenco dei pacchetti... Fatto Generazione albero delle dipendenze..Generazione albero delle dipendenze..Generazione albero delle dipendenze..Generazione albero delle dipendenze..Generazione albero delle dipendenze Lettura informazioni sullo stato... 0Lettura informazioni sullo stato... 0Lettura informazioni sullo stato... Fatto Nota, viene selezionato "libncurses5-dev" al posto di "ncurses-dev" libncurses5-dev is already the newest version (6.0+20160213-1ubuntu1). 0 aggiornati, 0 installati, 0 da rimuovere e 134 non aggiornati. jeanluc@cucc:~ sudo apt-get install unzip  
Lettura elenco dei pacchetti… Fatto  
Generazione albero delle dipendenze…Generazione albero delle dipendenze…Generazione albero delle dipendenze…Generazione albero delle dipendenze…Generazione albero delle dipendenze  
Lettura informazioni sullo stato… 0Lettura informazioni sullo stato… 0Lettura informazioni sullo stato… Fatto  
unzip is already the newest version (6.0-20ubuntu1).  
0 aggiornati, 0 installati, 0 da rimuovere e 134 non aggiornati.  
jeanluc@cucc:~ sudo apt-get install git Lettura elenco dei pacchetti... Fatto Generazione albero delle dipendenze..Generazione albero delle dipendenze..Generazione albero delle dipendenze..Generazione albero delle dipendenze..Generazione albero delle dipendenze Lettura informazioni sullo stato... 0Lettura informazioni sullo stato... 0Lettura informazioni sullo stato... Fatto git is already the newest version (1:2.7.4-0ubuntu1). 0 aggiornati, 0 installati, 0 da rimuovere e 134 non aggiornati. jeanluc@cucc:~ sudo apt-get install pyton  
Lettura elenco dei pacchetti… Fatto  
Generazione albero delle dipendenze…Generazione albero delle dipendenze…Generazione albero delle dipendenze…Generazione albero delle dipendenze…Generazione albero delle dipendenze  
Lettura informazioni sullo stato… 0Lettura informazioni sullo stato… 0Lettura informazioni sullo stato… Fatto  
E: Impossibile trovare il pacchetto pyton  
jeanluc@cucc:~ sudo apt-get install pyton Lettura elenco dei pacchetti... Fatto Generazione albero delle dipendenze..Generazione albero delle dipendenze..Generazione albero delle dipendenze..Generazione albero delle dipendenze..Generazione albero delle dipendenze Lettura informazioni sullo stato... 0Lettura informazioni sullo stato... 0Lettura informazioni sullo stato... Fatto E: Impossibile trovare il pacchetto pyton jeanluc@cucc:~ sudo apt-get install python  
Lettura elenco dei pacchetti… Fatto  
Generazione albero delle dipendenze…Generazione albero delle dipendenze…Generazione albero delle dipendenze…Generazione albero delle dipendenze…Generazione albero delle dipendenze  
Lettura informazioni sullo stato… 0Lettura informazioni sullo stato… 0Lettura informazioni sullo stato… Fatto  
python is already the newest version (2.7.11-1).  
0 aggiornati, 0 installati, 0 da rimuovere e 134 non aggiornati.  
jeanluc@cucc:~ sudo apt-get install zlib1g-dev Lettura elenco dei pacchetti... Fatto Generazione albero delle dipendenze..Generazione albero delle dipendenze..Generazione albero delle dipendenze..Generazione albero delle dipendenze..Generazione albero delle dipendenze Lettura informazioni sullo stato... 0Lettura informazioni sullo stato... 0Lettura informazioni sullo stato... Fatto zlib1g-dev is already the newest version (1:1.2.8.dfsg-2ubuntu4). 0 aggiornati, 0 installati, 0 da rimuovere e 134 non aggiornati. jeanluc@cucc:~ sudo apt-get install wget  
Lettura elenco dei pacchetti… Fatto  
Generazione albero delle dipendenze…Generazione albero delle dipendenze…Generazione albero delle dipendenze…Generazione albero delle dipendenze…Generazione albero delle dipendenze  
Lettura informazioni sullo stato… 0Lettura informazioni sullo stato… 0Lettura informazioni sullo stato… Fatto  
wget is already the newest version (1.17.1-1ubuntu1.1).  
0 aggiornati, 0 installati, 0 da rimuovere e 134 non aggiornati.  
jeanluc@cucc:~ sudo apt-get install bsdmainutils Lettura elenco dei pacchetti... Fatto Generazione albero delle dipendenze..Generazione albero delle dipendenze..Generazione albero delle dipendenze..Generazione albero delle dipendenze..Generazione albero delle dipendenze Lettura informazioni sullo stato... 0Lettura informazioni sullo stato... 0Lettura informazioni sullo stato... Fatto bsdmainutils is already the newest version (9.0.6ubuntu3). 0 aggiornati, 0 installati, 0 da rimuovere e 134 non aggiornati. jeanluc@cucc:~ sudo git clone [GitHub - zcash/zcash: Zcash - Internet Money](https://github.com/zcash/zcash.git)  
fatal: destination path ‘zcash’ already exists and is not an empty directory.  
jeanluc@cucc:~ ls Documenti Musica Scrivania Immagini Pubblici Video Modelli Scaricati zcash jeanluc@cucc:~ sudo rm zcash  
rm: cannot remove ‘zcash’: Is a directory  
jeanluc@cucc:~ sudo passwd root Enter new UNIX password: Retype new UNIX password: passwd: password updated successfully jeanluc@cucc:~ su  
Password:  
root@cucc:/home/jeanluc# ls  
Documenti Musica Scrivania  
Immagini Pubblici Video  
Modelli Scaricati zcash  
root@cucc:/home/jeanluc# rm zcash  
rm: cannot remove ‘zcash’: Is a directory  
root@cucc:/home/jeanluc# pcmanfm

\*\* (pcmanfm:1436): WARNING \*\*: The directory ‘/root/Modelli’ doesn’t exist, ignoring it  
Error creating proxy: The connection is closed (g-io-error-quark, 18)  
Error creating proxy: The connection is closed (g-io-error-quark, 18)  
Error creating proxy: The connection is closed (g-io-error-quark, 18)  
Error creating proxy: The connection is closed (g-io-error-quark, 18)  
Error creating proxy: The connection is closed (g-io-error-quark, 18)  
root@cucc:/home/jeanluc# git clone [GitHub - zcash/zcash: Zcash - Internet Money](https://github.com/zcash/zcash.git)  
Cloning into ‘zcash’…  
remote: Counting objects: 53298, done.  
Receiving objects: 1% (533/53298), Receiving objects: 1% (751/53298), Receiving objects: 2% (1066/53298),Receiving objects: 2% (1402/53298),Receiving objects: 3% (1599/53298),Receiving objects: 3% (2072/53298),Receiving objects: 4% (2132/53298),Receiving objects: 5% (2665/53298),Receiving objects: 5% (2814/53298),Receiving objects: 6% (3198/53298),Receiving objects: 6% (3576/53298),Receiving objects: 7% (3731/53298),Receiving objects: 8% (4264/53298),Receiving objects: 8% (4369/53298),Receiving objects: 9% (4797/53298),Receiving objects: 10% (5330/53298),Receiving objects: 10% (5347/53298),Receiving objects: 11% (5863/53298),Receiving objects: 12% (6396/53298),Receiving objects: 12% (6591/53298),Receiving objects: 13% (6929/53298),Receiving objects: 14% (7462/53298),Receiving objects: 14% (7950/53298),Receiving objects: 15% (7995/53298),Receiving objects: 16% (8528/53298),Receiving objects: 17% (9061/53298),Receiving objects: 17% (9328/53298),Receiving objects: 17% (9374/53298),Receiving objects: 17% (9376/53298),Receiving objects: 17% (9453/53298),Receiving objects: 18% (9594/53298),Receiving objects: 18% (9738/53298),Receiving objects: 18% (10071/53298)Receiving objects: 19% (10127/53298)Receiving objects: 19% (10290/53298)Receiving objects: 19% (10494/53298)Receiving objects: 19% (10568/53298)Receiving objects: 19% (10628/53298)Receiving objects: 20% (10660/53298)Receiving objects: 20% (10766/53298)Receiving objects: 20% (10766/53298)Receiving objects: 20% (10766/53298)Receiving objects: 20% (10768/53298)Receiving objects: 20% (10970/53298)Receiving objects: 21% (11193/53298)Receiving objects: 21% (11220/53298)Receiving objects: 21% (11231/53298)Receiving objects: 21% (11231/53298)Receiving objects: 21% (11420/53298)Receiving objects: 21% (11606/53298)Receiving objects: 21% (11606/53298)Receiving objects: 22% (11726/53298)Receiving objects: 22% (11838/53298)Receiving objects: 22% (11839/53298)Receiving objects: 22% (12124/53298)Receiving objects: 22% (12254/53298)Receiving objects: 23% (12259/53298)Receiving objects: 23% (12458/53298)Receiving objects: 23% (12497/53298)Receiving objects: 23% (12712/53298)Receiving objects: 24% (12792/53298)Receiving objects: 24% (12862/53298)Receiving objects: 24% (13035/53298)Receiving objects: 24% (13035/53298)Receiving objects: 24% (13036/53298)Receiving objects: 25% (13325/53298)Receiving objects: 26% (13858/53298)Receiving objects: 26% (14230/53298)Receiving objects: 27% (14391/53298)Receiving objects: 28% (14924/53298)Receiving objects: 28% (15170/53298)Receiving objects: 28% (15303/53298)Receiving objects: 29% (15457/53298)Receiving objects: 29% (15477/53298)Receiving objects: 29% (15710/53298)Receiving objects: 29% (15728/53298)Receiving objects: 30% (15990/53298)Receiving objects: 30% (16044/53298)Receiving objects: 30% (16135/53298)Receiving objects: 30% (16441/53298)Receiving objects: 30% (16469/53298)Receiving objects: 31% (16523/53298)Receiving objects: 31% (16794/53298)Receiving objects: 32% (17056/53298)Receiving objects: 32% (17064/53298)Receiving objects: 32% (17121/53298)Receiving objects: 32% (17225/53298)Receiving objects: 33% (17589/53298)Receiving objects: 33% (17672/53298)Receiving objects: 33% (17903/53298)Receiving objects: 34% (18122/53298)Receiving objects: 34% (18473/53298)Receiving objects: 35% (18655/53298)Receiving objects: 36% (19188/53298)Receiving objects: 36% (19346/53298)Receiving objects: 36% (19383/53298)Receiving objects: 37% (19721/53298)Receiving objects: 37% (19811/53298)Receiving objects: 38% (20254/53298)Receiving objects: 38% (20570/53298)Receiving objects: 39% (20787/53298)Receiving objects: 39% (20820/53298)Receiving objects: 39% (20859/53298)Receiving objects: 40% (21320/53298)Receiving objects: 40% (21541/53298)Receiving objects: 41% (21853/53298)Receiving objects: 42% (22386/53298)Receiving objects: 42% (22894/53298)Receiving objects: 43% (22919/53298)Receiving objects: 44% (23452/53298)Receiving objects: 45% (23985/53298)Receiving objects: 45% (24140/53298)Receiving objects: 46% (24518/53298)Receiving objects: 46% (24997/53298)Receiving objects: 47% (25051/53298)Receiving objects: 47% (25065/53298)Receiving objects: 48% (25584/53298)Receiving objects: 48% (25836/53298)Receiving objects: 49% (26117/53298)Receiving objects: 49% (26537/53298)Receiving objects: 49% (26590/53298)Receiving objects: 49% (26628/53298)Receiving objects: 50% (26649/53298)Receiving objects: 51% (27182/53298)Receiving objects: 51% (27223/53298)Receiving objects: 51% (27548/53298)Receiving objects: 51% (27575/53298)Receiving objects: 52% (27715/53298)Receiving objects: 52% (28208/53298)Receiving objects: 53% (28248/53298)Receiving objects: 54% (28781/53298)Receiving objects: 54% (28818/53298), 23.82 MiReceiving objects: 55% (29314/53298), 23.93 MiReceiving objects: 55% (29726/53298), 24.05 MiReceiving objects: 55% (29777/53298), 24.29 MiReceiving objects: 56% (29847/53298), 24.39 MiReceiving objects: 56% (29875/53298), 24.51 MiReceiving objects: 57% (30380/53298), 24.64 MiReceiving objects: 57% (30490/53298), 24.77 MiReceiving objects: 57% (30551/53298), 25.02 MiB Receiving objects: 58% (30913/53298), 25.14 MiB Receiving objects: 58% (31189/53298), 25.27 MiB Receiving objects: 59% (31446/53298), 25.41 MiB Receiving objects: 59% (31656/53298), 25.56 MiB Receiving objects: 59% (31909/53298), 25.87 MiB Receiving objects: 60% (31979/53298), 25.87 MiB Receiving objects: 60% (32408/53298), 26.20 MiB Receiving objects: 61% (32512/53298), 26.20 MiB Receiving objects: 62% (33045/53298), 26.37 MiB Receiving objects: 63% (33578/53298), 26.54 MiB Receiving objects: 63% (33608/53298), 26.54 MiB Receiving objects: 64% (34111/53298), 26.71 MiB Receiving objects: 64% (34504/53298), 26.86 MiB Receiving objects: 65% (34644/53298), 26.86 MiB Receiving objects: 65% (34939/53298), 26.97 MiB Receiving objects: 66% (35177/53298), 27.26 MiB Receiving objects: 66% (35311/53298), 27.26 MiB Receiving objects: 67% (35710/53298), 27.26 MiB Receiving objects: 68% (36243/53298), 27.39 MiB Receiving objects: 68% (36677/53298), 27.57 MiB Receiving objects: 68% (36725/53298), 27.88 MiB Receiving objects: 69% (36776/53298), 27.88 MiB Receiving objects: 69% (36963/53298), 28.21 MiB remote: Total 53298 (delta 0), reused 0 (delta 0), pack-reused 53298  
Receiving objects: 100% (53298/53298), 38.10 MiB | 343.00 KiB/s, done.  
Resolving deltas: 100% (40417/40417), done.  
Checking connectivity… done.  
root@cucc:/home/jeanluc# ls  
Documenti Immagini Modelli Musica Pubblici Scaricati Scrivania Video zcash  
root@cucc:/home/jeanluc# cd zcash  
root@cucc:/home/jeanluc/zcash# ls  
autogen.sh code\_of\_conduct.md contrib depends INSTALL Makefile.am README.md src  
build-aux configure.ac COPYING doc libbitcoinconsensus.pc.in qa share zcutil  
root@cucc:/home/jeanluc/zcash# git checkout zc.v0.11.2.z5  
Branch zc.v0.11.2.z5 set up to track remote branch zc.v0.11.2.z5 from origin.  
Switched to a new branch ‘zc.v0.11.2.z5’  
root@cucc:/home/jeanluc/zcash# ./zcutil/fetch-params.sh  
zcash - fetch-params.sh

This script will fetch the Zcash zkSNARK parameters and verify their  
integrity with sha256sum.

The parameters currently are about 2GiB in size, so plan accordingly  
for your bandwidth constraints. If the files are already present and  
have the correct sha256sum, no networking is used.

Creating params directory. For details about this directory, see:  
/root/.zcash-params/README

Retrieving: [https://z.cash/downloads/z5-proving.key](https://z.cash/downloads/z5-proving.key)  
–2016-06-28 18:12:14-- [https://z.cash/downloads/z5-proving.key](https://z.cash/downloads/z5-proving.key)  
Resolving z.cash (z.cash)… 192.99.10.82  
Connecting to z.cash (z.cash)|192.99.10.82|:443… connected.  
HTTP request sent, awaiting response… 302 Found  
Location: [https://s3.amazonaws.com/zcashalpha/z5-proving.key](https://s3.amazonaws.com/zcashalpha/z5-proving.key) [following]  
–2016-06-28 18:12:15-- [https://s3.amazonaws.com/zcashalpha/z5-proving.key](https://s3.amazonaws.com/zcashalpha/z5-proving.key)  
Resolving [s3.amazonaws.com](http://s3.amazonaws.com) ([s3.amazonaws.com](http://s3.amazonaws.com))… 54.231.14.40  
Connecting to [s3.amazonaws.com](http://s3.amazonaws.com) ([s3.amazonaws.com](http://s3.amazonaws.com))|54.231.14.40|:443… connected.  
HTTP request sent, awaiting response… 200 OK  
Length: 1398718735 (1,3G) [binary/octet-stream]  
Saving to: ‘/root/.zcash-params/regtest/z5-proving.key.dl’

```
 0K 0% 271K=0,8s

```

2016-06-28 18:12:18 (271 KB/s) - Read error at byte 225927/1398718735 (error:1408F119:SSL routines:SSL3\_GET\_RECORD:decryption failed or bad record mac). Retrying.

–2016-06-28 18:12:19-- (try: 2) [https://s3.amazonaws.com/zcashalpha/z5-proving.key](https://s3.amazonaws.com/zcashalpha/z5-proving.key)  
Connecting to [s3.amazonaws.com](http://s3.amazonaws.com) ([s3.amazonaws.com](http://s3.amazonaws.com))|54.231.14.40|:443… connected.  
HTTP request sent, awaiting response… 206 Partial Content  
Length: 1398718735 (1,3G), 1398492808 (1,3G) remaining [binary/octet-stream]  
Saving to: ‘/root/.zcash-params/regtest/z5-proving.key.dl’

```
 0K
 0K 0% 317K=1,7s

```

2016-06-28 18:12:23 (317 KB/s) - Read error at byte 792134/1398718735 (error:1408F119:SSL routines:SSL3\_GET\_RECORD:decryption failed or bad record mac). Retrying.

–2016-06-28 18:12:25-- (try: 3) [https://s3.amazonaws.com/zcashalpha/z5-proving.key](https://s3.amazonaws.com/zcashalpha/z5-proving.key)  
Connecting to [s3.amazonaws.com](http://s3.amazonaws.com) ([s3.amazonaws.com](http://s3.amazonaws.com))|54.231.14.40|:443… connected.  
HTTP request sent, awaiting response… 206 Partial Content  
Length: 1398718735 (1,3G), 1397926601 (1,3G) remaining [binary/octet-stream]  
Saving to: ‘/root/.zcash-params/regtest/z5-proving.key.dl’

```
 0K
 0K . 0% 333K=3,4s

```

2016-06-28 18:12:30 (333 KB/s) - Read error at byte 1958029/1398718735 (error:1408F119:SSL routines:SSL3\_GET\_RECORD:decryption failed or bad record mac). Retrying.

–2016-06-28 18:12:33-- (try: 4) [https://s3.amazonaws.com/zcashalpha/z5-proving.key](https://s3.amazonaws.com/zcashalpha/z5-proving.key)  
Connecting to [s3.amazonaws.com](http://s3.amazonaws.com) ([s3.amazonaws.com](http://s3.amazonaws.com))|54.231.14.40|:443… connected.  
HTTP request sent, awaiting response… 206 Partial Content  
Length: 1398718735 (1,3G), 1396760706 (1,3G) remaining [binary/octet-stream]  
Saving to: ‘/root/.zcash-params/regtest/z5-proving.key.dl’

```
 0K ,. 0% 320K=1,9s

```

2016-06-28 18:12:36 (320 KB/s) - Read error at byte 2584275/1398718735 (error:1408F119:SSL routines:SSL3\_GET\_RECORD:decryption failed or bad record mac). Retrying.

–2016-06-28 18:12:40-- (try: 5) [https://s3.amazonaws.com/zcashalpha/z5-proving.key](https://s3.amazonaws.com/zcashalpha/z5-proving.key)  
Connecting to [s3.amazonaws.com](http://s3.amazonaws.com) ([s3.amazonaws.com](http://s3.amazonaws.com))|54.231.14.40|:443… connected.  
HTTP request sent, awaiting response… 206 Partial Content  
Length: 1398718735 (1,3G), 1396134460 (1,3G) remaining [binary/octet-stream]  
Saving to: ‘/root/.zcash-params/regtest/z5-proving.key.dl’

```
 0K ,,. 0% 330K=2,7s

```

2016-06-28 18:12:45 (330 KB/s) - Read error at byte 3489049/1398718735 (error:1408F119:SSL routines:SSL3\_GET\_RECORD:decryption failed or bad record mac). Retrying.

–2016-06-28 18:12:50-- (try: 6) [https://s3.amazonaws.com/zcashalpha/z5-proving.key](https://s3.amazonaws.com/zcashalpha/z5-proving.key)  
Connecting to [s3.amazonaws.com](http://s3.amazonaws.com) ([s3.amazonaws.com](http://s3.amazonaws.com))|54.231.14.40|:443… connected.  
HTTP request sent, awaiting response… 206 Partial Content  
Length: 1398718735 (1,3G), 1395229686 (1,3G) remaining [binary/octet-stream]  
Saving to: ‘/root/.zcash-params/regtest/z5-proving.key.dl’

```
 0K ,,,. 0% 204K=3,5s

```

2016-06-28 18:12:54 (204 KB/s) - Read error at byte 4211927/1398718735 (error:1408F119:SSL routines:SSL3\_GET\_RECORD:decryption failed or bad record mac). Retrying.

–2016-06-28 18:13:00-- (try: 7) [https://s3.amazonaws.com/zcashalpha/z5-proving.key](https://s3.amazonaws.com/zcashalpha/z5-proving.key)  
Connecting to [s3.amazonaws.com](http://s3.amazonaws.com) ([s3.amazonaws.com](http://s3.amazonaws.com))|54.231.14.40|:443… connected.  
HTTP request sent, awaiting response… 206 Partial Content  
Length: 1398718735 (1,3G), 1394506808 (1,3G) remaining [binary/octet-stream]  
Saving to: ‘/root/.zcash-params/regtest/z5-proving.key.dl’

```
 0K ,,,, 0% 312K=1,6s

```

2016-06-28 18:13:04 (312 KB/s) - Read error at byte 4716317/1398718735 (error:1408F119:SSL routines:SSL3\_GET\_RECORD:decryption failed or bad record mac). Retrying.

–2016-06-28 18:13:11-- (try: 8) [https://s3.amazonaws.com/zcashalpha/z5-proving.key](https://s3.amazonaws.com/zcashalpha/z5-proving.key)  
Connecting to [s3.amazonaws.com](http://s3.amazonaws.com) ([s3.amazonaws.com](http://s3.amazonaws.com))|54.231.14.40|:443… connected.  
HTTP request sent, awaiting response… 206 Partial Content  
Length: 1398718735 (1,3G), 1394002418 (1,3G) remaining [binary/octet-stream]  
Saving to: ‘/root/.zcash-params/regtest/z5-proving.key.dl’

```
 0K ,,,, 0% 305K=1,3s

```

2016-06-28 18:13:14 (305 KB/s) - Read error at byte 5133667/1398718735 (error:1408F119:SSL routines:SSL3\_GET\_RECORD:decryption failed or bad record mac). Retrying.

–2016-06-28 18:13:22-- (try: 9) [https://s3.amazonaws.com/zcashalpha/z5-proving.key](https://s3.amazonaws.com/zcashalpha/z5-proving.key)  
Connecting to [s3.amazonaws.com](http://s3.amazonaws.com) ([s3.amazonaws.com](http://s3.amazonaws.com))|54.231.14.40|:443… connected.  
HTTP request sent, awaiting response… 206 Partial Content  
Length: 1398718735 (1,3G), 1393585068 (1,3G) remaining [binary/octet-stream]  
Saving to: ‘/root/.zcash-params/regtest/z5-proving.key.dl’

```
 0K ,,,,.. 0% 279K=4,4s

```

2016-06-28 18:13:28 (279 KB/s) - Read error at byte 6386601/1398718735 (error:1408F119:SSL routines:SSL3\_GET\_RECORD:decryption failed or bad record mac). Retrying.

–2016-06-28 18:13:37-- (try:10) [https://s3.amazonaws.com/zcashalpha/z5-proving.key](https://s3.amazonaws.com/zcashalpha/z5-proving.key)  
Connecting to [s3.amazonaws.com](http://s3.amazonaws.com) ([s3.amazonaws.com](http://s3.amazonaws.com))|54.231.14.40|:443… connected.  
HTTP request sent, awaiting response… 206 Partial Content  
Length: 1398718735 (1,3G), 1392332134 (1,3G) remaining [binary/octet-stream]  
Saving to: ‘/root/.zcash-params/regtest/z5-proving.key.dl’

```
 0K ,,,,,,. 0% 262K=5,1s

```

2016-06-28 18:13:44 (262 KB/s) - Read error at byte 7753575/1398718735 (error:1408F119:SSL routines:SSL3\_GET\_RECORD:decryption failed or bad record mac). Retrying.

–2016-06-28 18:13:54-- (try:11) [https://s3.amazonaws.com/zcashalpha/z5-proving.key](https://s3.amazonaws.com/zcashalpha/z5-proving.key)  
Connecting to [s3.amazonaws.com](http://s3.amazonaws.com) ([s3.amazonaws.com](http://s3.amazonaws.com))|54.231.14.40|:443… connected.  
HTTP request sent, awaiting response… 206 Partial Content  
Length: 1398718735 (1,3G), 1390965160 (1,3G) remaining [binary/octet-stream]  
Saving to: ‘/root/.zcash-params/regtest/z5-proving.key.dl’

```
 0K ,,,,,,, 0% 213K=0,4s

```

2016-06-28 18:13:55 (213 KB/s) - Read error at byte 7840765/1398718735 (error:1408F119:SSL routines:SSL3\_GET\_RECORD:decryption failed or bad record mac). Retrying.

–2016-06-28 18:14:05-- (try:12) [https://s3.amazonaws.com/zcashalpha/z5-proving.key](https://s3.amazonaws.com/zcashalpha/z5-proving.key)  
Connecting to [s3.amazonaws.com](http://s3.amazonaws.com) ([s3.amazonaws.com](http://s3.amazonaws.com))|54.231.14.40|:443… connected.  
HTTP request sent, awaiting response… 206 Partial Content  
Length: 1398718735 (1,3G), 1390877970 (1,3G) remaining [binary/octet-stream]  
Saving to: ‘/root/.zcash-params/regtest/z5-proving.key.dl’

```
 0K ,,,,,,,. .. 0% 327K=10s

```

2016-06-28 18:14:18 (327 KB/s) - Read error at byte 11339331/1398718735 (error:1408F119:SSL routines:SSL3\_GET\_RECORD:decryption failed or bad record mac). Retrying.

–2016-06-28 18:14:28-- (try:13) [https://s3.amazonaws.com/zcashalpha/z5-proving.key](https://s3.amazonaws.com/zcashalpha/z5-proving.key)  
Connecting to [s3.amazonaws.com](http://s3.amazonaws.com) ([s3.amazonaws.com](http://s3.amazonaws.com))|54.231.14.40|:443… connected.  
HTTP request sent, awaiting response… 206 Partial Content  
Length: 1398718735 (1,3G), 1387379404 (1,3G) remaining [binary/octet-stream]  
Saving to: ‘/root/.zcash-params/regtest/z5-proving.key.dl’

```
 0K ,,,,,,,, ,,. 0% 319K=1,8s

```

2016-06-28 18:14:31 (319 KB/s) - Read error at byte 11922944/1398718735 (error:1408F119:SSL routines:SSL3\_GET\_RECORD:decryption failed or bad record mac). Retrying.

–2016-06-28 18:14:41-- (try:14) [https://s3.amazonaws.com/zcashalpha/z5-proving.key](https://s3.amazonaws.com/zcashalpha/z5-proving.key)  
Connecting to [s3.amazonaws.com](http://s3.amazonaws.com) ([s3.amazonaws.com](http://s3.amazonaws.com))|54.231.14.40|:443… connected.  
HTTP request sent, awaiting response… 206 Partial Content  
Length: 1398718735 (1,3G), 1386795791 (1,3G) remaining [binary/octet-stream]  
Saving to: ‘/root/.zcash-params/regtest/z5-proving.key.dl’

```
 0K ,,,,,,,, ,,, 0% 317K=1,8s

```

2016-06-28 18:14:45 (317 KB/s) - Read error at byte 12506557/1398718735 (error:1408F119:SSL routines:SSL3\_GET\_RECORD:decryption failed or bad record mac). Retrying.

–2016-06-28 18:14:55-- (try:15) [https://s3.amazonaws.com/zcashalpha/z5-proving.key](https://s3.amazonaws.com/zcashalpha/z5-proving.key)  
Connecting to [s3.amazonaws.com](http://s3.amazonaws.com) ([s3.amazonaws.com](http://s3.amazonaws.com))|54.231.14.40|:443… connected.  
HTTP request sent, awaiting response… 206 Partial Content  
Length: 1398718735 (1,3G), 1386212178 (1,3G) remaining [binary/octet-stream]  
Saving to: ‘/root/.zcash-params/regtest/z5-proving.key.dl’

```
 0K ,,,,,,,, ,,,. 0% 306K=1,6s

```

2016-06-28 18:14:58 (306 KB/s) - Read error at byte 12993538/1398718735 (error:1408F119:SSL routines:SSL3\_GET\_RECORD:decryption failed or bad record mac). Retrying.

–2016-06-28 18:15:08-- (try:16) [https://s3.amazonaws.com/zcashalpha/z5-proving.key](https://s3.amazonaws.com/zcashalpha/z5-proving.key)  
Connecting to [s3.amazonaws.com](http://s3.amazonaws.com) ([s3.amazonaws.com](http://s3.amazonaws.com))|54.231.14.40|:443… connected.  
HTTP request sent, awaiting response… 206 Partial Content  
Length: 1398718735 (1,3G), 1385725197 (1,3G) remaining [binary/octet-stream]  
Saving to: ‘/root/.zcash-params/regtest/z5-proving.key.dl’

```
 0K ,,,,,,,, ,,,, 0% 300K=1,2s

```

2016-06-28 18:15:11 (300 KB/s) - Read error at byte 13376663/1398718735 (error:1408F119:SSL routines:SSL3\_GET\_RECORD:decryption failed or bad record mac). Retrying.

–2016-06-28 18:15:21-- (try:17) [https://s3.amazonaws.com/zcashalpha/z5-proving.key](https://s3.amazonaws.com/zcashalpha/z5-proving.key)  
Connecting to [s3.amazonaws.com](http://s3.amazonaws.com) ([s3.amazonaws.com](http://s3.amazonaws.com))|54.231.14.40|:443… connected.  
HTTP request sent, awaiting response… 206 Partial Content  
Length: 1398718735 (1,3G), 1385342072 (1,3G) remaining [binary/octet-stream]  
Saving to: ‘/root/.zcash-params/regtest/z5-proving.key.dl’

```
 0K ,,,,,,,, ,,,,.. 1% 343K=5,7s

```

2016-06-28 18:15:29 (343 KB/s) - Read error at byte 15360732/1398718735 (error:1408F119:SSL routines:SSL3\_GET\_RECORD:decryption failed or bad record mac). Retrying.

–2016-06-28 18:15:39-- (try:18) [https://s3.amazonaws.com/zcashalpha/z5-proving.key](https://s3.amazonaws.com/zcashalpha/z5-proving.key)  
Connecting to [s3.amazonaws.com](http://s3.amazonaws.com) ([s3.amazonaws.com](http://s3.amazonaws.com))|54.231.14.40|:443… connected.  
HTTP request sent, awaiting response… 206 Partial Content  
Length: 1398718735 (1,3G), 1383358003 (1,3G) remaining [binary/octet-stream]  
Saving to: ‘/root/.zcash-params/regtest/z5-proving.key.dl’

```
 0K ,,,,,,,, ,,,,,, 1% 162K=1,9s

```

2016-06-28 18:15:43 (162 KB/s) - Read error at byte 15673633/1398718735 (error:1408F119:SSL routines:SSL3\_GET\_RECORD:decryption failed or bad record mac). Retrying.

---

<div class="post-metadata">

**Author:** ![gianluca](https://avatars.discourse-cdn.com/v4/letter/g/82dd89/32.png) [@gianluca](https://forum.zcashcommunity.com/u/gianluca)\
**Post date:** [June 28, 2016, 4:29pm UTC](https://forum.zcashcommunity.com/t/zcash-alpha-on-lubunto-doesnt-work/912/2 "2016-06-28T16:29:14Z")

</div>

–2016-06-28 18:15:53-- (try:19) [https://s3.amazonaws.com/zcashalpha/z5-proving.key](https://s3.amazonaws.com/zcashalpha/z5-proving.key)  
Connecting to [s3.amazonaws.com](http://s3.amazonaws.com) ([s3.amazonaws.com](http://s3.amazonaws.com))|54.231.14.40|:443… connected.  
HTTP request sent, awaiting response… 206 Partial Content  
Length: 1398718735 (1,3G), 1383045102 (1,3G) remaining [binary/octet-stream]  
Saving to: ‘/root/.zcash-params/regtest/z5-proving.key.dl’

```
 0K ,,,,,,,, ,,,,,,. 1% 304K=1,3s

```

2016-06-28 18:15:56 (304 KB/s) - Read error at byte 16083166/1398718735 (error:1408F119:SSL routines:SSL3\_GET\_RECORD:decryption failed or bad record mac). Retrying.

–2016-06-28 18:16:06-- (try:20) [https://s3.amazonaws.com/zcashalpha/z5-proving.key](https://s3.amazonaws.com/zcashalpha/z5-proving.key)  
Connecting to [s3.amazonaws.com](http://s3.amazonaws.com) ([s3.amazonaws.com](http://s3.amazonaws.com))|54.231.14.40|:443… connected.  
HTTP request sent, awaiting response… 206 Partial Content  
Length: 1398718735 (1,3G), 1382635569 (1,3G) remaining [binary/octet-stream]  
Saving to: ‘/root/.zcash-params/regtest/z5-proving.key.dl’

```
 0K ,,,,,,,, ,,,,,,,. . 1% 343K=6,9s

```

2016-06-28 18:16:14 (343 KB/s) - Read error at byte 18502435/1398718735 (error:1408F119:SSL routines:SSL3\_GET\_RECORD:decryption failed or bad record mac). Giving up.

root@cucc:/home/jeanluc/zcash#  
root@cucc:/home/jeanluc/zcash# ./zcutil/build.sh -j4  
+++ readlink -f ./zcutil/build.sh  
++ dirname /home/jeanluc/zcash/zcutil/build.sh

- cd /home/jeanluc/zcash/zcutil/…
- LCOV\_ARG=
- ‘[’ x-j4 = x–enable-lcov ‘]’  
++ pwd
- PREFIX=/home/jeanluc/zcash/depends/x86\_64-unknown-linux-gnu/
- make -j4 -C ./depends/ V=1 NO\_QT=1  
make: Entering directory ‘/home/jeanluc/zcash/depends’  
mkdir -p /home/jeanluc/zcash/depends/sources/download-stamps /home/jeanluc/zcash/depends/sources  
rm -f /home/jeanluc/zcash/depends/sources/download-stamps/.stamp\_fetched-native\_ccache-ccache-3.1.9.tar.bz2.hash  
touch /home/jeanluc/zcash/depends/sources/download-stamps/.stamp\_fetched-native\_ccache-ccache-3.1.9.tar.bz2.hash  
cd /home/jeanluc/zcash/depends/sources/download-stamps; (test -f /home/jeanluc/zcash/depends/sources/ccache-3.1.9.tar.bz2 || ( mkdir -p /home/jeanluc/zcash/depends/work/download/native\_ccache-3.1.9 && echo Fetching native\_ccache… && ( wget --timeout=10 --tries=3 -nv -O “/home/jeanluc/zcash/depends/work/download/native\_ccache-3.1.9/ccache-3.1.9.tar.bz2.temp” “[https://z.cash/depends-sources/ccache-3.1.9.tar.bz2](https://z.cash/depends-sources/ccache-3.1.9.tar.bz2)” || wget --timeout=10 --tries=3 -nv -O “/home/jeanluc/zcash/depends/work/download/native\_ccache-3.1.9/ccache-3.1.9.tar.bz2.temp” “[http://samba.org/ftp/ccache/ccache-3.1.9.tar.bz2](http://samba.org/ftp/ccache/ccache-3.1.9.tar.bz2)” ) && echo “04d3e2e438ac8d4cc4b110b68cdd61bd59226c6588739a4a386869467f5ced7c /home/jeanluc/zcash/depends/work/download/native\_ccache-3.1.9/ccache-3.1.9.tar.bz2.temp” \> /home/jeanluc/zcash/depends/work/download/native\_ccache-3.1.9/.ccache-3.1.9.tar.bz2.hash && sha256sum -c /home/jeanluc/zcash/depends/work/download/native\_ccache-3.1.9/.ccache-3.1.9.tar.bz2.hash && mv /home/jeanluc/zcash/depends/work/download/native\_ccache-3.1.9/ccache-3.1.9.tar.bz2.temp /home/jeanluc/zcash/depends/sources/ccache-3.1.9.tar.bz2 && rm -rf /home/jeanluc/zcash/depends/work/download/native\_ccache-3.1.9 ))  
Fetching native\_ccache…  
2016-06-28 18:19:06 URL:[https://z.cash/depends-sources/ccache-3.1.9.tar.bz2](https://z.cash/depends-sources/ccache-3.1.9.tar.bz2) [266547/266547] → “/home/jeanluc/zcash/depends/work/download/native\_ccache-3.1.9/ccache-3.1.9.tar.bz2.temp” [1]  
/home/jeanluc/zcash/depends/work/download/native\_ccache-3.1.9/ccache-3.1.9.tar.bz2.temp: OK  
cd /home/jeanluc/zcash/depends/sources; sha256sum ccache-3.1.9.tar.bz2 \>\> /home/jeanluc/zcash/depends/sources/download-stamps/.stamp\_fetched-native\_ccache-ccache-3.1.9.tar.bz2.hash;  
touch /home/jeanluc/zcash/depends/sources/download-stamps/.stamp\_fetched-native\_ccache-ccache-3.1.9.tar.bz2.hash  
echo Extracting native\_ccache…  
Extracting native\_ccache…  
mkdir -p /home/jeanluc/zcash/depends/work/build/i686-pc-linux-gnu/native\_ccache/3.1.9-deaa1ee8c66  
cd /home/jeanluc/zcash/depends/work/build/i686-pc-linux-gnu/native\_ccache/3.1.9-deaa1ee8c66; mkdir -p /home/jeanluc/zcash/depends/work/build/i686-pc-linux-gnu/native\_ccache/3.1.9-deaa1ee8c66 && echo “04d3e2e438ac8d4cc4b110b68cdd61bd59226c6588739a4a386869467f5ced7c /home/jeanluc/zcash/depends/sources/ccache-3.1.9.tar.bz2” \> /home/jeanluc/zcash/depends/work/build/i686-pc-linux-gnu/native\_ccache/3.1.9-deaa1ee8c66/.ccache-3.1.9.tar.bz2.hash && sha256sum -c /home/jeanluc/zcash/depends/work/build/i686-pc-linux-gnu/native\_ccache/3.1.9-deaa1ee8c66/.ccache-3.1.9.tar.bz2.hash && tar --strip-components=1 -xf /home/jeanluc/zcash/depends/sources/ccache-3.1.9.tar.bz2  
/home/jeanluc/zcash/depends/sources/ccache-3.1.9.tar.bz2: OK  
touch /home/jeanluc/zcash/depends/work/build/i686-pc-linux-gnu/native\_ccache/3.1.9-deaa1ee8c66/.stamp\_extracted  
echo Preprocessing native\_ccache…  
Preprocessing native\_ccache…  
mkdir -p /home/jeanluc/zcash/depends/work/build/i686-pc-linux-gnu/native\_ccache/3.1.9-deaa1ee8c66 /home/jeanluc/zcash/depends/work/build/i686-pc-linux-gnu/native\_ccache/3.1.9-deaa1ee8c66/.patches-deaa1ee8c66  
cd /home/jeanluc/zcash/depends/work/build/i686-pc-linux-gnu/native\_ccache/3.1.9-deaa1ee8c66;  
touch /home/jeanluc/zcash/depends/work/build/i686-pc-linux-gnu/native\_ccache/3.1.9-deaa1ee8c66/.stamp\_preprocessed  
echo Configuring native\_ccache…  
Configuring native\_ccache…  
rm -rf /home/jeanluc/zcash/depends/i686-pc-linux-gnu; mkdir -p /home/jeanluc/zcash/depends/i686-pc-linux-gnu/lib; cd /home/jeanluc/zcash/depends/i686-pc-linux-gnu;  
mkdir -p /home/jeanluc/zcash/depends/work/build/i686-pc-linux-gnu/native\_ccache/3.1.9-deaa1ee8c66/.  
cd /home/jeanluc/zcash/depends/work/build/i686-pc-linux-gnu/native\_ccache/3.1.9-deaa1ee8c66/.; PKG\_CONFIG\_LIBDIR=/home/jeanluc/zcash/depends/i686-pc-linux-gnu/native/lib/pkgconfig PKG\_CONFIG\_PATH=/home/jeanluc/zcash/depends/i686-pc-linux-gnu/native/share/pkgconfig PATH=/home/jeanluc/zcash/depends/i686-pc-linux-gnu/native/bin:/usr/local/sbin:/usr/local/bin:/usr/sbin:/usr/bin:/sbin:/bin:/usr/games:/usr/local/games ./configure --host=i686-pc-linux-gnu --disable-dependency-tracking --prefix=/home/jeanluc/zcash/depends/i686-pc-linux-gnu/native CC=“gcc” CXX=“g++” NM=“nm” RANLIB=“ranlib” AR=“ar” CPPFLAGS=“-I/home/jeanluc/zcash/depends/i686-pc-linux-gnu/native/include " LDFLAGS=”-L/home/jeanluc/zcash/depends/i686-pc-linux-gnu/native/lib "  
configure: WARNING: unrecognized options: --disable-dependency-tracking  
configure: WARNING: if you wanted to set the --build type, don’t use --host.  
If a cross compiler is detected then cross compile mode will be used  
configure: Configuring ccache  
checking for i686-pc-linux-gnu-gcc… gcc  
checking whether the C compiler works… yes  
checking for C compiler default output file name… a.out  
checking for suffix of executables…  
checking whether we are cross compiling… no  
checking for suffix of object files… o  
checking whether we are using the GNU C compiler… yes  
checking whether gcc accepts -g… yes  
checking for gcc option to accept ISO C89… none needed  
checking how to run the C preprocessor… gcc -E  
checking for a BSD-compatible install… /usr/bin/install -c  
checking for i686-pc-linux-gnu-ranlib… ranlib  
checking for i686-pc-linux-gnu-ar… ar  
checking for dirent.h that defines DIR… yes  
checking for library containing opendir… none required  
checking whether time.h and sys/time.h may both be included… yes  
checking for grep that handles long lines and -e… /bin/grep  
checking for egrep… /bin/grep -E  
checking for ANSI C header files… yes  
checking for sys/types.h… yes  
checking for sys/stat.h… yes  
checking for stdlib.h… yes  
checking for string.h… yes  
checking for memory.h… yes  
checking for strings.h… yes  
checking for inttypes.h… yes  
checking for stdint.h… yes  
checking for unistd.h… yes  
checking for stdbool.h that conforms to C99… yes  
checking for \_Bool… yes  
checking for sys/wait.h that is POSIX.1 compatible… yes  
checking ctype.h usability… yes  
checking ctype.h presence… yes  
checking for ctype.h… yes  
checking pwd.h usability… yes  
checking pwd.h presence… yes  
checking for pwd.h… yes  
checking for stdlib.h… (cached) yes  
checking for string.h… (cached) yes  
checking for strings.h… (cached) yes  
checking sys/time.h usability… yes  
checking sys/time.h presence… yes  
checking for sys/time.h… yes  
checking sys/mman.h usability… yes  
checking sys/mman.h presence… yes  
checking for sys/mman.h… yes  
checking termios.h usability… yes  
checking termios.h presence… yes  
checking for termios.h… yes  
checking for gethostname… yes  
checking for getopt\_long… yes  
checking for getpwuid… yes  
checking for gettimeofday… yes  
checking for mkstemp… yes  
checking for realpath… yes  
checking for strndup… yes  
checking for utimes… yes  
checking for compar\_fn\_t in stdlib.h… yes  
checking for stdarg.h… yes  
checking for varargs.h… no  
checking for vsnprintf… yes  
checking whether vsnprintf is C99 compliant… yes  
checking for snprintf… yes  
checking whether snprintf is C99 compliant… yes  
checking for vasprintf… yes  
checking for asprintf… yes  
checking for library containing cos… -lm  
checking for zlib \>= 1.2.3… yes  
checking for gzdopen in -lz… yes  
checking for inline… inline  
checking for extern inline… no  
configure: creating ./config.status  
config.status: creating Makefile  
config.status: creating config.h  
configure: WARNING: unrecognized options: --disable-dependency-tracking  
configure: now build ccache by running make  
touch /home/jeanluc/zcash/depends/work/build/i686-pc-linux-gnu/native\_ccache/3.1.9-deaa1ee8c66/./.stamp\_configured  
echo Building native\_ccache…  
Building native\_ccache…  
mkdir -p /home/jeanluc/zcash/depends/work/build/i686-pc-linux-gnu/native\_ccache/3.1.9-deaa1ee8c66/.  
cd /home/jeanluc/zcash/depends/work/build/i686-pc-linux-gnu/native\_ccache/3.1.9-deaa1ee8c66/.; PATH=/home/jeanluc/zcash/depends/i686-pc-linux-gnu/native/bin:/usr/local/sbin:/usr/local/bin:/usr/sbin:/usr/bin:/sbin:/bin:/usr/games:/usr/local/games make  
make[1]: Entering directory ‘/home/jeanluc/zcash/depends/work/build/i686-pc-linux-gnu/native\_ccache/3.1.9-deaa1ee8c66’  
gcc -g -O2 -Wall -W -DHAVE\_CONFIG\_H -I/home/jeanluc/zcash/depends/i686-pc-linux-gnu/native/include -I. -I. -c -o main.o main.c  
gcc -g -O2 -Wall -W -DHAVE\_CONFIG\_H -I/home/jeanluc/zcash/depends/i686-pc-linux-gnu/native/include -I. -I. -c -o ccache.o ccache.c  
gcc -g -O2 -Wall -W -DHAVE\_CONFIG\_H -I/home/jeanluc/zcash/depends/i686-pc-linux-gnu/native/include -I. -I. -c -o mdfour.o mdfour.c  
gcc -g -O2 -Wall -W -DHAVE\_CONFIG\_H -I/home/jeanluc/zcash/depends/i686-pc-linux-gnu/native/include -I. -I. -c -o hash.o hash.c  
gcc -g -O2 -Wall -W -DHAVE\_CONFIG\_H -I/home/jeanluc/zcash/depends/i686-pc-linux-gnu/native/include -I. -I. -c -o execute.o execute.c  
gcc -g -O2 -Wall -W -DHAVE\_CONFIG\_H -I/home/jeanluc/zcash/depends/i686-pc-linux-gnu/native/include -I. -I. -c -o util.o util.c  
gcc -g -O2 -Wall -W -DHAVE\_CONFIG\_H -I/home/jeanluc/zcash/depends/i686-pc-linux-gnu/native/include -I. -I. -c -o args.o args.c  
gcc -g -O2 -Wall -W -DHAVE\_CONFIG\_H -I/home/jeanluc/zcash/depends/i686-pc-linux-gnu/native/include -I. -I. -c -o stats.o stats.c  
gcc -g -O2 -Wall -W -DHAVE\_CONFIG\_H -I/home/jeanluc/zcash/depends/i686-pc-linux-gnu/native/include -I. -I. -c -o version.o version.c  
gcc -g -O2 -Wall -W -DHAVE\_CONFIG\_H -I/home/jeanluc/zcash/depends/i686-pc-linux-gnu/native/include -I. -I. -c -o cleanup.o cleanup.c  
gcc -g -O2 -Wall -W -DHAVE\_CONFIG\_H -I/home/jeanluc/zcash/depends/i686-pc-linux-gnu/native/include -I. -I. -c -o snprintf.o snprintf.c  
gcc -g -O2 -Wall -W -DHAVE\_CONFIG\_H -I/home/jeanluc/zcash/depends/i686-pc-linux-gnu/native/include -I. -I. -c -o unify.o unify.c  
gcc -g -O2 -Wall -W -DHAVE\_CONFIG\_H -I/home/jeanluc/zcash/depends/i686-pc-linux-gnu/native/include -I. -I. -c -o manifest.o manifest.c  
gcc -g -O2 -Wall -W -DHAVE\_CONFIG\_H -I/home/jeanluc/zcash/depends/i686-pc-linux-gnu/native/include -I. -I. -c -o hashtable.o hashtable.c  
gcc -g -O2 -Wall -W -DHAVE\_CONFIG\_H -I/home/jeanluc/zcash/depends/i686-pc-linux-gnu/native/include -I. -I. -c -o hashtable\_itr.o hashtable\_itr.c  
gcc -g -O2 -Wall -W -DHAVE\_CONFIG\_H -I/home/jeanluc/zcash/depends/i686-pc-linux-gnu/native/include -I. -I. -c -o murmurhashneutral2.o murmurhashneutral2.c  
gcc -g -O2 -Wall -W -DHAVE\_CONFIG\_H -I/home/jeanluc/zcash/depends/i686-pc-linux-gnu/native/include -I. -I. -c -o hashutil.o hashutil.c  
gcc -g -O2 -Wall -W -DHAVE\_CONFIG\_H -I/home/jeanluc/zcash/depends/i686-pc-linux-gnu/native/include -I. -I. -c -o getopt\_long.o getopt\_long.c  
gcc -g -O2 -Wall -W -DHAVE\_CONFIG\_H -I/home/jeanluc/zcash/depends/i686-pc-linux-gnu/native/include -I. -I. -c -o exitfn.o exitfn.c  
gcc -g -O2 -Wall -W -DHAVE\_CONFIG\_H -I/home/jeanluc/zcash/depends/i686-pc-linux-gnu/native/include -I. -I. -c -o lockfile.o lockfile.c  
gcc -g -O2 -Wall -W -DHAVE\_CONFIG\_H -I/home/jeanluc/zcash/depends/i686-pc-linux-gnu/native/include -I. -I. -c -o counters.o counters.c  
gcc -g -O2 -Wall -W -DHAVE\_CONFIG\_H -I/home/jeanluc/zcash/depends/i686-pc-linux-gnu/native/include -I. -I. -c -o language.o language.c  
gcc -g -O2 -Wall -W -DHAVE\_CONFIG\_H -I/home/jeanluc/zcash/depends/i686-pc-linux-gnu/native/include -I. -I. -c -o compopt.o compopt.c  
gcc -g -O2 -Wall -W -L/home/jeanluc/zcash/depends/i686-pc-linux-gnu/native/lib -o ccache main.o ccache.o mdfour.o hash.o execute.o util.o args.o stats.o version.o cleanup.o snprintf.o unify.o manifest.o hashtable.o hashtable\_itr.o murmurhashneutral2.o hashutil.o getopt\_long.o exitfn.o lockfile.o counters.o language.o compopt.o -lm -lz  
make[1]: Leaving directory ‘/home/jeanluc/zcash/depends/work/build/i686-pc-linux-gnu/native\_ccache/3.1.9-deaa1ee8c66’  
touch /home/jeanluc/zcash/depends/work/build/i686-pc-linux-gnu/native\_ccache/3.1.9-deaa1ee8c66/./.stamp\_built  
echo Staging native\_ccache…  
Staging native\_ccache…  
mkdir -p /home/jeanluc/zcash/depends/work/staging/i686-pc-linux-gnu/native\_ccache/3.1.9-deaa1ee8c66//home/jeanluc/zcash/depends/i686-pc-linux-gnu  
cd /home/jeanluc/zcash/depends/work/build/i686-pc-linux-gnu/native\_ccache/3.1.9-deaa1ee8c66/.; PATH=/home/jeanluc/zcash/depends/i686-pc-linux-gnu/native/bin:/usr/local/sbin:/usr/local/bin:/usr/sbin:/usr/bin:/sbin:/bin:/usr/games:/usr/local/games make DESTDIR=/home/jeanluc/zcash/depends/work/staging/i686-pc-linux-gnu/native\_ccache/3.1.9-deaa1ee8c66 install  
make[1]: Entering directory ‘/home/jeanluc/zcash/depends/work/build/i686-pc-linux-gnu/native\_ccache/3.1.9-deaa1ee8c66’  
make[1]: warning: jobserver unavailable: using -j1. Add ‘+’ to parent make rule.  
/usr/bin/install -c -d /home/jeanluc/zcash/depends/work/staging/i686-pc-linux-gnu/native\_ccache/3.1.9-deaa1ee8c66/home/jeanluc/zcash/depends/i686-pc-linux-gnu/native/bin  
/usr/bin/install -c -m 755 ccache /home/jeanluc/zcash/depends/work/staging/i686-pc-linux-gnu/native\_ccache/3.1.9-deaa1ee8c66/home/jeanluc/zcash/depends/i686-pc-linux-gnu/native/bin  
/usr/bin/install -c -d /home/jeanluc/zcash/depends/work/staging/i686-pc-linux-gnu/native\_ccache/3.1.9-deaa1ee8c66/home/jeanluc/zcash/depends/i686-pc-linux-gnu/native/share/man/man1  
/usr/bin/install -c -m 644 ./ccache.1 /home/jeanluc/zcash/depends/work/staging/i686-pc-linux-gnu/native\_ccache/3.1.9-deaa1ee8c66/home/jeanluc/zcash/depends/i686-pc-linux-gnu/native/share/man/man1/  
make[1]: Leaving directory ‘/home/jeanluc/zcash/depends/work/build/i686-pc-linux-gnu/native\_ccache/3.1.9-deaa1ee8c66’  
rm -rf /home/jeanluc/zcash/depends/work/build/i686-pc-linux-gnu/native\_ccache/3.1.9-deaa1ee8c66  
touch /home/jeanluc/zcash/depends/work/staging/i686-pc-linux-gnu/native\_ccache/3.1.9-deaa1ee8c66/.stamp\_staged  
echo Postprocessing native\_ccache…  
Postprocessing native\_ccache…  
cd /home/jeanluc/zcash/depends/work/staging/i686-pc-linux-gnu/native\_ccache/3.1.9-deaa1ee8c66/home/jeanluc/zcash/depends/i686-pc-linux-gnu/native; rm -rf lib include  
touch /home/jeanluc/zcash/depends/work/staging/i686-pc-linux-gnu/native\_ccache/3.1.9-deaa1ee8c66/home/jeanluc/zcash/depends/i686-pc-linux-gnu/native/.stamp\_postprocessed  
echo Caching native\_ccache…  
Caching native\_ccache…  
cd /home/jeanluc/zcash/depends/work/staging/i686-pc-linux-gnu/native\_ccache/3.1.9-deaa1ee8c66//home/jeanluc/zcash/depends/i686-pc-linux-gnu; find . | sort | tar --no-recursion -czf /home/jeanluc/zcash/depends/work/staging/i686-pc-linux-gnu/native\_ccache/3.1.9-deaa1ee8c66/native\_ccache-3.1.9-deaa1ee8c66.tar.gz -T -  
mkdir -p /home/jeanluc/zcash/depends/built/i686-pc-linux-gnu/native\_ccache  
rm -rf /home/jeanluc/zcash/depends/built/i686-pc-linux-gnu/native\_ccache && mkdir -p /home/jeanluc/zcash/depends/built/i686-pc-linux-gnu/native\_ccache  
mv /home/jeanluc/zcash/depends/work/staging/i686-pc-linux-gnu/native\_ccache/3.1.9-deaa1ee8c66/native\_ccache-3.1.9-deaa1ee8c66.tar.gz /home/jeanluc/zcash/depends/built/i686-pc-linux-gnu/native\_ccache/native\_ccache-3.1.9-deaa1ee8c66.tar.gz  
rm -rf /home/jeanluc/zcash/depends/work/staging/i686-pc-linux-gnu/native\_ccache/3.1.9-deaa1ee8c66  
cd /home/jeanluc/zcash/depends/built/i686-pc-linux-gnu/native\_ccache; sha256sum native\_ccache-3.1.9-deaa1ee8c66.tar.gz \> /home/jeanluc/zcash/depends/built/i686-pc-linux-gnu/native\_ccache/native\_ccache-3.1.9-deaa1ee8c66.tar.gz.hash  
mkdir -p /home/jeanluc/zcash/depends/sources/download-stamps /home/jeanluc/zcash/depends/sources  
rm -f /home/jeanluc/zcash/depends/sources/download-stamps/.stamp\_fetched-native\_comparisontool-pull-tests-0f7b5d8.jar.hash  
touch /home/jeanluc/zcash/depends/sources/download-stamps/.stamp\_fetched-native\_comparisontool-pull-tests-0f7b5d8.jar.hash  
cd /home/jeanluc/zcash/depends/sources/download-stamps; (test -f /home/jeanluc/zcash/depends/sources/pull-tests-0f7b5d8.jar || ( mkdir -p /home/jeanluc/zcash/depends/work/download/native\_comparisontool-0f7b5d8 && echo Fetching native\_comparisontool… && ( wget --timeout=10 --tries=3 -nv -O “/home/jeanluc/zcash/depends/work/download/native\_comparisontool-0f7b5d8/pull-tests-0f7b5d8.jar.temp” “[https://z.cash/depends-sources/pull-tests-0f7b5d8.jar](https://z.cash/depends-sources/pull-tests-0f7b5d8.jar)” || wget --timeout=10 --tries=3 -nv -O “/home/jeanluc/zcash/depends/work/download/native\_comparisontool-0f7b5d8/pull-tests-0f7b5d8.jar.temp” “[https://github.com/TheBlueMatt/test-scripts/raw/38b490a2599d422b12d5ce8f165792f63fd8f54f/pull-tests-0f7b5d8.jar](https://github.com/TheBlueMatt/test-scripts/raw/38b490a2599d422b12d5ce8f165792f63fd8f54f/pull-tests-0f7b5d8.jar)” ) && echo “ecd43b988a8b673b483e4f69f931596360a5e90fc415c75c4c259faa690df198 /home/jeanluc/zcash/depends/work/download/native\_comparisontool-0f7b5d8/pull-tests-0f7b5d8.jar.temp” \> /home/jeanluc/zcash/depends/work/download/native\_comparisontool-0f7b5d8/.pull-tests-0f7b5d8.jar.hash && sha256sum -c /home/jeanluc/zcash/depends/work/download/native\_comparisontool-0f7b5d8/.pull-tests-0f7b5d8.jar.hash && mv /home/jeanluc/zcash/depends/work/download/native\_comparisontool-0f7b5d8/pull-tests-0f7b5d8.jar.temp /home/jeanluc/zcash/depends/sources/pull-tests-0f7b5d8.jar && rm -rf /home/jeanluc/zcash/depends/work/download/native\_comparisontool-0f7b5d8 ))  
Fetching native\_comparisontool…  
funcs.mk:238: recipe for target ‘/home/jeanluc/zcash/depends/sources/download-stamps/.stamp\_fetched-native\_comparisontool-pull-tests-0f7b5d8.jar.hash’ failed  
make: \*\*\* [/home/jeanluc/zcash/depends/sources/download-stamps/.stamp\_fetched-native\_comparisontool-pull-tests-0f7b5d8.jar.hash] Error 4  
make: Leaving directory ‘/home/jeanluc/zcash/depends’  
root@cucc:/home/jeanluc/zcash#  
root@cucc:/home/jeanluc/zcash# ./qa/zcash/full-test-suite.sh  
===== BEGIN: /home/jeanluc/zcash/qa/zcash/ensure-no-dot-so-in-depends.py  
arch-specific build dir not present: /home/jeanluc/zcash/qa/zcash/…/…/depends/x86\_64-unknown-linux-gnu  
Did you build the ./depends tree?  
Are you on a currently unsupported architecture?  
FAIL.  
===== FAILED: /home/jeanluc/zcash/qa/zcash/ensure-no-dot-so-in-depends.py  
===== BEGIN: /home/jeanluc/zcash/src/zerocash/tests/utilTest  
./qa/zcash/full-test-suite.sh: line 15: /home/jeanluc/zcash/src/zerocash/tests/utilTest: No such file or directory  
===== FAILED: /home/jeanluc/zcash/src/zerocash/tests/utilTest  
===== BEGIN: make check || { echo === ./src/test-suite.log === ; cat ./src/test-suite.log ; false ; }  
make: \*\*\* No rule to make target ‘check’. Stop.  
=== ./src/test-suite.log ===  
cat: ./src/test-suite.log: No such file or directory  
===== FAILED: make check || { echo === ./src/test-suite.log === ; cat ./src/test-suite.log ; false ; }  
root@cucc:/home/jeanluc/zcash# ./qa/pull-tester/rpc-tests.sh  
./qa/pull-tester/rpc-tests.sh: line 6: /home/jeanluc/zcash/qa/pull-tester/tests-config.sh: No such file or directory  
root@cucc:/home/jeanluc/zcash# .zcash/zcash.conf  
bash: .zcash/zcash.conf: No such file or directory  
root@cucc:/home/jeanluc/zcash# touch zcash.conf  
root@cucc:/home/jeanluc/zcash# leafpad zcash.conf  
root@cucc:/home/jeanluc/zcash# ./src/zcashd -daemon  
bash: ./src/zcashd: No such file or directory  
root@cucc:/home/jeanluc/zcash#

---

<div class="post-metadata">

**Author:** ![Voluntary](https://sea2.discourse-cdn.com/zcash/user_avatar/forum.zcashcommunity.com/voluntary/32/4343_2.png) [@Voluntary](https://forum.zcashcommunity.com/u/Voluntary)\
**Post date:** [June 28, 2016, 8:30pm UTC](https://forum.zcashcommunity.com/t/zcash-alpha-on-lubunto-doesnt-work/912/3 "2016-06-28T20:30:03Z")

</div>

I was unable to build an earlier release on Linux Mint and that system may not have had enough memory either… After that I switched to a system with more memory and Ubuntu 15.10

If you don’t want to install a different OS, perhaps you could try using Docker and see if this works for you - [https://minezcash.com/docker-zcash-install/](https://minezcash.com/docker-zcash-install/) I’m interested to know if that works for you.

---

<div class="post-metadata">

**Author:** ![Shawn](https://sea2.discourse-cdn.com/zcash/user_avatar/forum.zcashcommunity.com/shawn/32/187_2.png) [@Shawn](https://forum.zcashcommunity.com/u/Shawn)\
**Post date:** [June 28, 2016, 10:32pm UTC](https://forum.zcashcommunity.com/t/zcash-alpha-on-lubunto-doesnt-work/912/4 "2016-06-28T22:32:03Z")

</div>

It looks like your connection failed to download the proving key but you decided to compile anyway. You may need to delete your install and start with a clean slate.

---

<div class="post-metadata">

**Author:** ![gianluca](https://avatars.discourse-cdn.com/v4/letter/g/82dd89/32.png) [@gianluca](https://forum.zcashcommunity.com/u/gianluca)\
**Post date:** [June 28, 2016, 10:54pm UTC](https://forum.zcashcommunity.com/t/zcash-alpha-on-lubunto-doesnt-work/912/5 "2016-06-28T22:54:24Z")

</div>

yes i look at this point . I try so many times but it doesn’ t download the 1.3Gb file. I downloaded at put the file in the right folder manually.  
The first phase is ok. Tomorrow i’ll check again if works.  
Thank you !

---

<div class="post-metadata">

**Author:** ![Voluntary](https://sea2.discourse-cdn.com/zcash/user_avatar/forum.zcashcommunity.com/voluntary/32/4343_2.png) [@Voluntary](https://forum.zcashcommunity.com/u/Voluntary)\
**Post date:** [June 28, 2016, 11:41pm UTC](https://forum.zcashcommunity.com/t/zcash-alpha-on-lubunto-doesnt-work/912/6 "2016-06-28T23:41:39Z")

</div>

If you had a successful compile you should only need to run fetch-params.sh again.

Is there enough demand to justify a torrent of the key files?

---

<div class="post-metadata">

**Author:** ![gianluca](https://avatars.discourse-cdn.com/v4/letter/g/82dd89/32.png) [@gianluca](https://forum.zcashcommunity.com/u/gianluca)\
**Post date:** [June 30, 2016, 12:45pm UTC](https://forum.zcashcommunity.com/t/zcash-alpha-on-lubunto-doesnt-work/912/7 "2016-06-30T12:45:46Z")

</div>

It still doesn’t work. I have a problem when i try to compile.How can i solve this problem.I’m using lubuntu 16.04 x86\_64

Fetching native\_comparisontool…  
funcs.mk:238: recipe for target ‘/home/jeanluc/zcash/depends/sources/download-stamps/.stamp\_fetched-native\_comparisontool-pull-tests-0f7b5d8.jar.hash’ failed  
make: \*\*\* [/home/jeanluc/zcash/depends/sources/download-stamps/.stamp\_fetched-native\_comparisontool-pull-tests-0f7b5d8.jar.hash] Error 4  
make: Leaving directory ‘/home/jeanluc/zcash/depends’

---

<div class="post-metadata">

**Author:** ![Shawn](https://sea2.discourse-cdn.com/zcash/user_avatar/forum.zcashcommunity.com/shawn/32/187_2.png) [@Shawn](https://forum.zcashcommunity.com/u/Shawn)\
**Post date:** [June 30, 2016, 1:33pm UTC](https://forum.zcashcommunity.com/t/zcash-alpha-on-lubunto-doesnt-work/912/8 "2016-06-30T13:33:12Z")

</div>

Are you sure you have all the prerequisites installed before compiling?  
`sudo apt-get install \ build-essential pkg-config libgtest-dev libc6-dev m4 \ g++-multilib autoconf libtool ncurses-dev unzip git python \ zlib1g-dev wget bsdmainutils`

Then  
`git clone https://github.com/zcash/zcash.git`

Finally, (from inside the zcash folder) run;  
`git checkout zc.v0.11.2.z5 ./zcutil/fetch-params.sh`

Make sure you have 4GB memory free for the compiler or it may fail

---

<div class="post-metadata">

**Author:** ![gianluca](https://avatars.discourse-cdn.com/v4/letter/g/82dd89/32.png) [@gianluca](https://forum.zcashcommunity.com/u/gianluca)\
**Post date:** [June 30, 2016, 1:36pm UTC](https://forum.zcashcommunity.com/t/zcash-alpha-on-lubunto-doesnt-work/912/9 "2016-06-30T13:36:12Z")

</div>

i’have still 100 gb free and i do all of the previous operation

---

<div class="post-metadata">

**Author:** ![Shawn](https://sea2.discourse-cdn.com/zcash/user_avatar/forum.zcashcommunity.com/shawn/32/187_2.png) [@Shawn](https://forum.zcashcommunity.com/u/Shawn)\
**Post date:** [June 30, 2016, 1:37pm UTC](https://forum.zcashcommunity.com/t/zcash-alpha-on-lubunto-doesnt-work/912/10 "2016-06-30T13:37:24Z")

</div>

4GB RAM free for compile, not HDD

---

<div class="post-metadata">

**Author:** ![gianluca](https://avatars.discourse-cdn.com/v4/letter/g/82dd89/32.png) [@gianluca](https://forum.zcashcommunity.com/u/gianluca)\
**Post date:** [June 30, 2016, 2:13pm UTC](https://forum.zcashcommunity.com/t/zcash-alpha-on-lubunto-doesnt-work/912/11 "2016-06-30T14:13:38Z")

</div>

ah, ok i’ll change pc. thank you

---

<div class="post-metadata">

**Author:** ![Voluntary](https://sea2.discourse-cdn.com/zcash/user_avatar/forum.zcashcommunity.com/voluntary/32/4343_2.png) [@Voluntary](https://forum.zcashcommunity.com/u/Voluntary)\
**Post date:** [June 30, 2016, 10:15pm UTC](https://forum.zcashcommunity.com/t/zcash-alpha-on-lubunto-doesnt-work/912/12 "2016-06-30T22:15:21Z")

</div>

My first attempt at compiling zcash was on a Linux Mint system with 6GB and it wasn’t successful. Next was Ubuntu 15.10 with 16GB, which was fine. I’ve since tried it on a faster system but with only 8GB, which also worked but I noticed it was slower as some swap space was used - although I don’t recall if that was during the compile or running the tests…

---

<div class="post-metadata">

**Author:** ![Shawn](https://sea2.discourse-cdn.com/zcash/user_avatar/forum.zcashcommunity.com/shawn/32/187_2.png) [@Shawn](https://forum.zcashcommunity.com/u/Shawn)\
**Post date:** [June 30, 2016, 11:18pm UTC](https://forum.zcashcommunity.com/t/zcash-alpha-on-lubunto-doesnt-work/912/13 "2016-06-30T23:18:23Z")

</div>

I also tried on Mint with no luck, I’ve only had success with Ubuntu and Lubuntu. I actually prefer Lubuntu for my older PC’s because the OS itself uses less RAM. But for my Big PC I run Ubuntu and Lubuntu in VM’s. I want to learn Docker more to get rid of the OS overhead on my VM’s

---

<div class="post-metadata">

**Author:** ![Voluntary](https://sea2.discourse-cdn.com/zcash/user_avatar/forum.zcashcommunity.com/voluntary/32/4343_2.png) [@Voluntary](https://forum.zcashcommunity.com/u/Voluntary)\
**Post date:** [June 30, 2016, 11:34pm UTC](https://forum.zcashcommunity.com/t/zcash-alpha-on-lubunto-doesnt-work/912/14 "2016-06-30T23:34:57Z")

</div>

If you can spare the time and if you’re curious enough (and if you have a windows VM…) can you try installing Docker on to windows and then see if the Zcash docker image (?) works with it?

---

<div class="post-metadata">

**Author:** ![Shawn](https://sea2.discourse-cdn.com/zcash/user_avatar/forum.zcashcommunity.com/shawn/32/187_2.png) [@Shawn](https://forum.zcashcommunity.com/u/Shawn)\
**Post date:** [June 30, 2016, 11:44pm UTC](https://forum.zcashcommunity.com/t/zcash-alpha-on-lubunto-doesnt-work/912/15 "2016-06-30T23:44:44Z")

</div>

The way I understand it is that the Docker container uses the kernel of the host PC, since the is no hypervisor you can’t run a separate OS than the host system. Since Zcash won’t work on Windows yet, Docker won’t help.  
Actually I’m not even sure you can run Docker on Windows at all? I’ll have to Google it…

---

<div class="post-metadata">

**Author:** ![daira](https://sea2.discourse-cdn.com/zcash/user_avatar/forum.zcashcommunity.com/daira/32/43253_2.png) [@daira](https://forum.zcashcommunity.com/u/daira)\
**Post date:** [July 1, 2016, 9:30pm UTC](https://forum.zcashcommunity.com/t/zcash-alpha-on-lubunto-doesnt-work/912/16 "2016-07-01T21:30:39Z")

</div>

The problem with native\_comparisontool is likely to be fixed in the next (z6) release. I do not know whether that will expose other problems; the developers use Debian and Ubuntu and so that’s obviously where build problems are likely to be ironed out first.
